Okay, so I was building with the Floating window commit from Gerrit and everything was going good until I came upon this error. I have cherry picked every patch needed for the Floating Window to works and made sure all conflicts were fixed correctly checking them with the code on gerrit but now I'm getting this error.
PHP:
target thumb C++: third_party_WebKit_Source_modules_modules_gyp <= external/chromium_org/third_party/WebKit/Source/modules/encryptedmedia/MediaKeySession.cpp
target thumb C++: third_party_WebKit_Source_modules_modules_gyp <= external/chromium_org/third_party/WebKit/Source/modules/filesystem/DOMFilePath.cpp
target thumb C++: third_party_WebKit_Source_modules_modules_gyp <= external/chromium_org/third_party/WebKit/Source/modules/filesystem/DOMFileSystem.cpp
frameworks/base/core/java/android/app/Activity.java:1638: cannot find symbol
symbol : method refreshAppLayoutSize()
location: class android.app.Activity
refreshAppLayoutSize();
^
frameworks/base/core/java/android/app/Activity.java:5434: cannot find symbol
symbol : method refreshAppLayoutSize()
location: class android.app.Activity
refreshAppLayoutSize();
^
target thumb C++: third_party_WebKit_Source_modules_modules_gyp <= external/chromium_org/third_party/WebKit/Source/modules/filesystem/DOMFileSystemBase.cpp
In file included from external/chromium_org/third_party/WebKit/Source/modules/encryptedmedia/MediaKeySession.cpp:27:0:
external/chromium_org/third_party/WebKit/Source/modules/encryptedmedia/MediaKeySession.h: In constructor 'WebCore::MediaKeySession::MediaKeySession(WebCore::ScriptExecutionContext*, WebCore::ContentDecryptionModule*, WebCore::MediaKeys*)':
external/chromium_org/third_party/WebKit/Source/modules/encryptedmedia/MediaKeySession.h:94:31: warning: 'WebCore::MediaKeySession::m_asyncEventQueue' will be initialized after [-Wreorder]
external/chromium_org/third_party/WebKit/Source/modules/encryptedmedia/MediaKeySession.h:92:12: warning: 'WTF::String WebCore::MediaKeySession::m_keySystem' [-Wreorder]
external/chromium_org/third_party/WebKit/Source/modules/encryptedmedia/MediaKeySession.cpp:45:1: warning: when initialized here [-Wreorder]
target thumb C++: third_party_WebKit_Source_modules_modules_gyp <= external/chromium_org/third_party/WebKit/Source/modules/filesystem/DOMFileSystemSync.cpp
target thumb C++: third_party_WebKit_Source_modules_modules_gyp <= external/chromium_org/third_party/WebKit/Source/modules/filesystem/DOMWindowFileSystem.cpp
target thumb C++: third_party_WebKit_Source_modules_modules_gyp <= external/chromium_org/third_party/WebKit/Source/modules/filesystem/DataTransferItemFileSystem.cpp
target thumb C++: third_party_WebKit_Source_modules_modules_gyp <= external/chromium_org/third_party/WebKit/Source/modules/filesystem/DirectoryEntry.cpp
Note: Some input files use or override a deprecated API.
Note: Recompile with -Xlint:deprecation for details.
Note: Some input files use unchecked or unsafe operations.
Note: Recompile with -Xlint:unchecked for details.
2 errors
make: *** [/home/hammondfamily/Android/Omnifloating/out/target/common/obj/JAVA_LIBRARIES/framework-base_intermediates/classes-full-debug.jar] Error 41
make: *** Waiting for unfinished jobs....
real 417m57.651s
user 1463m39.925s
sys 76m9.535s
It's saying it cannot find symbol for line 1638 and 5434 for
PHP:
symbol : method refreshAppLayoutSize()
location: class android.app.Activity
refreshAppLayoutSize();
^
Any help would be greatly appreciated. I really want to try this out.
DREWHAMM974 said:
[/PHP] Any help would be greatly appreciated. I really want to try this out.
Click to expand...
Click to collapse
I would suggest a make clobber, repo sync and then do your cherry-picks in this order:
patch 6561- SystemUI: Fix missing top task in recent panel
patch 6380 - base: Floating window with multi-tasking
patch 6378 - [1/2] Base: implement App circle sidebar
patch 6379 - [2/2] OmniGears: Implement App circle sidebar
patch 6515 - Base: App Circle sidebar (add support floating window)
patch 6627 - Base: App Circle sidebar (add support Samsung multiwindow flags)
Resolve any conflicts that may arise. Also, leave out the multi-window patch or the multi<->floating patch for now, too many conflicts. I used the mentioned patchsets, cherry-picking in that order and finally got a working build for my Asus TF101 tablet. It's worth getting to build right.
I got it to build finally. I was missing the omnigears patch
Sent from my LG-LS980 using XDA Premium 4 mobile app
Related
Hello
Please any one can compile libwebcore.so from source with applying this patch :
https://github.com/Y6b/android_external_webkit/commit/8637f8f6b8f78aef69a1a1919c9df54358513706
Source : http://nv-tegra.nvidia.com/gitweb/
This patch for support Arabic in browser .
Thanks in advance .
any one can help please .
Code:
target thumb C++: libwebcore <= external/webkit/WebCore/platform/graphics/Font.cpp
target thumb C++: libwebcore <= external/webkit/WebCore/rendering/ArabicShapingUtils.cpp
target thumb C++: libwebcore <= external/webkit/WebCore/rendering/RenderText.cpp
target StaticLib: libwebcore (out/target/product/harmony/obj/STATIC_LIBRARIES/libwebcore_intermediates/libwebcore.a)
target SharedLib: libwebcore (out/target/product/harmony/obj/SHARED_LIBRARIES/libwebcore_intermediates/LINKED/libwebcore.so)
target Prelink: libwebcore (out/target/product/harmony/symbols/system/lib/libwebcore.so)
target Strip: libwebcore (out/target/product/harmony/obj/lib/libwebcore.so)
Install: out/target/product/harmony/system/lib/libwebcore.so
Chenglu said:
Code:
target thumb C++: libwebcore <= external/webkit/WebCore/platform/graphics/Font.cpp
target thumb C++: libwebcore <= external/webkit/WebCore/rendering/ArabicShapingUtils.cpp
target thumb C++: libwebcore <= external/webkit/WebCore/rendering/RenderText.cpp
target StaticLib: libwebcore (out/target/product/harmony/obj/STATIC_LIBRARIES/libwebcore_intermediates/libwebcore.a)
target SharedLib: libwebcore (out/target/product/harmony/obj/SHARED_LIBRARIES/libwebcore_intermediates/LINKED/libwebcore.so)
target Prelink: libwebcore (out/target/product/harmony/symbols/system/lib/libwebcore.so)
target Strip: libwebcore (out/target/product/harmony/obj/lib/libwebcore.so)
Install: out/target/product/harmony/system/lib/libwebcore.so
Click to expand...
Click to collapse
Thank You very Much .
You solve my problem
recompile
is it possible to recompile to use it with cyanogen 7 2.3
BO7AMZA said:
is it possible to recompile to use it with cyanogen 7 2.3
Click to expand...
Click to collapse
http://www.mediafire.com/?roof8odv13sw4hb
use this files with cyanogen 7 .
cant be used
Must be recompiled with cyanogen 7 source tegra 2
Tried ur file doesnt work
BO7AMZA said:
Must be recompiled with cyanogen 7 source tegra 2
Tried ur file doesnt work
Click to expand...
Click to collapse
only use libwebcore.so from my link
Tried your file didnt work the browser crashes
BO7AMZA said:
Tried your file didnt work the browser crashes
Click to expand...
Click to collapse
Which ROM You are Using ?
any one can apply this patch to https://github.com/aosp-gtablet
Chenglu said:
Code:
target thumb C++: libwebcore <= external/webkit/WebCore/platform/graphics/Font.cpp
target thumb C++: libwebcore <= external/webkit/WebCore/rendering/ArabicShapingUtils.cpp
target thumb C++: libwebcore <= external/webkit/WebCore/rendering/RenderText.cpp
target StaticLib: libwebcore (out/target/product/harmony/obj/STATIC_LIBRARIES/libwebcore_intermediates/libwebcore.a)
target SharedLib: libwebcore (out/target/product/harmony/obj/SHARED_LIBRARIES/libwebcore_intermediates/LINKED/libwebcore.so)
target Prelink: libwebcore (out/target/product/harmony/symbols/system/lib/libwebcore.so)
target Strip: libwebcore (out/target/product/harmony/obj/lib/libwebcore.so)
Install: out/target/product/harmony/system/lib/libwebcore.so
Click to expand...
Click to collapse
Chenglu,
I'm new in this
Will you tell me command line how to compile this?
dony71 said:
Chenglu,
I'm new in this
Will you tell me command line how to compile this?
Click to expand...
Click to collapse
I'll be thankful too if someone share!
Thank you for this, really helped me out
Got the following error while compiling:
target Java: KeyChain (/ubhome/theo/android/omnirom/out/target/common/obj/APPS/KeyChain_intermediates/classes)
target Java: LiveWallpapers (/ubhome/theo/android/omnirom/out/target/common/obj/APPS/LiveWallpapers_intermediates/classes)
packages/apps/CertInstaller/src/com/android/certinstaller/CertInstallerMain.java:88: cannot find symbol
symbol : variable EXTRA_SHOW_ADVANCED
location: class android.provider.DocumentsContract
openIntent.putExtra(DocumentsContract.EXTRA_SHOW_ADVANCED, true);
^
Note: packages/apps/CertInstaller/src/com/android/certinstaller/CertInstaller.java uses or overrides a deprecated API.
Note: Recompile with -Xlint:deprecation for details.
Note: Some input files use unchecked or unsafe operations.
Note: Recompile with -Xlint:unchecked for details.
1 error
Any ideas where the problem is ?
Greetz
Open /frameworks/base/core/java/android/provider/DocumentsContract.java, go to line #86 and check if it is like this:
Code:
public static final String EXTRA_SHOW_ADVANCED = "android.content.extra.SHOW_ADVANCED";
If not, you have either data corruption due to forced system reboob, power outage or similar, or you have a bad cherry pick.
If you have tried to cherry pick the popular Multi-widow™, you are out of luck: it breaks the build today and will continue to do so
until someone does a rebase..
In either case, rm -rf your /frameworks and /.repo/projects/frameworks, then resync, check again DocumentsContract.java's line 86
and get the build rolling if everything's OK.
chasmodo said:
If you have tried to cherry pick the popular Multi-widow™, you are out of luck: it breaks the build today and will continue to do so
until someone does a rebase..
Click to expand...
Click to collapse
Not anymore
https://gerrit.omnirom.org/#/c/1510/
chasmodo said:
Open /frameworks/base/core/java/android/provider/DocumentsContract.java, go to line #86 and check if it is like this:
Code:
public static final String EXTRA_SHOW_ADVANCED = "android.content.extra.SHOW_ADVANCED";
If not, you have either data corruption due to forced system reboob, power outage or similar, or you have a bad cherry pick.
If you have tried to cherry pick the popular Multi-widow™, you are out of luck: it breaks the build today and will continue to do so
until someone does a rebase..
In either case, rm -rf your /frameworks and /.repo/projects/frameworks, then resync, check again DocumentsContract.java's line 86
and get the build rolling if everything's OK.
Click to expand...
Click to collapse
Yap, you're right...
Seems that for some reason have data corruption. Will completely refetch sources and try again...
Thanx...
And the next one after refetch of sources....
target thumb C++: third_party_WebKit_Source_web_webkit_gyp <= external/chromium_org/third_party/WebKit/Source/web/DOMUtilitiesPrivate.cpp
target thumb C++: third_party_WebKit_Source_web_webkit_gyp <= external/chromium_org/third_party/WebKit/Source/web/DatabaseObserver.cpp
frameworks/base/core/java/com/android/internal/view/CheckableLinearLayout.java:48: cannot find symbol
symbol : variable check
location: class com.android.internal.R.id
mCheckBox = (CheckBox) findViewById(R.id.check);
^
target thumb C++: third_party_WebKit_Source_web_webkit_gyp <= external/chromium_org/third_party/WebKit/Source/web/DateTimeChooserImpl.cpp
target thumb C++: third_party_WebKit_Source_web_webkit_gyp <= external/chromium_org/third_party/WebKit/Source/web/DeviceOrientationClientProxy.cpp
Note: Some input files use or override a deprecated API.
Note: Recompile with -Xlint:deprecation for details.
Note: Some input files use unchecked or unsafe operations.
Note: Recompile with -Xlint:unchecked for details.
Greetz
Temporary commented out to see if it is the only problem. Now continue compiling...
EDIT2:
after a lot of frustrating compilation errors, i finally found the problem. Beside making sure that all 'java' components point to JDK6, this is also necessary for 'config.jar'. So check this with:
$ sudo update-alternatives --config jar
and select the jar tool provided by JDK6 instead of other jar tools like fastjar or openjdk jar.
Hello there,
I got stuck at building PA for HTC Desire, have tried it several times. I have enough disk space -- I have made a fresh repo sync -- I have also tried with "make -j1". Then switched GCC to armeabi-4.4.3 to 4.7 and to 4.8 -- it always ends up with this error:
Code:
hardware/qcom/display-legacy/liboverlay/overlayUtils.h:38:36: fatal error: linux/msm_mdp.h: No such file or directory
The missing header file is actually present in the kernel tree. I have build with this kernel and the display-legacy a handful of custom roms without any issue.
Kernel: https://github.com/spezi77/android_kernel_htc_qsd8k
Display-legacy: https://github.com/Evervolv/android_hardware_qcom_display-legacy
Any tip is welcome! :good:
Thanks!
More lines:
Code:
target thumb C: libloc_api-rpc <= hardware/qcom/gps-legacy/loc_api/libloc_api-rpc/gen-3200/loc_api_rpc_glue.c
target thumb C: libloc_api-rpc <= hardware/qcom/gps-legacy/loc_api/libloc_api-rpc/src/loc_apicb_appinit.c
target thumb C: libloc_api-rpc <= hardware/qcom/gps-legacy/loc_api/libloc_api-rpc/src/loc_api_sync_call.c
Import includes file: /home/spezi77/android/paranoid/out/target/product/bravo/obj/SHARED_LIBRARIES/gralloc.qsd8k_intermediates/import_includes
target arm C++: libGLESv1_CM <= frameworks/native/opengl/libs/GLES_CM/gl.cpp
Import includes file: /home/spezi77/android/paranoid/out/target/product/bravo/obj/SHARED_LIBRARIES/hwcomposer.qsd8k_intermediates/import_includes
target thumb C++: liboverlay <= hardware/qcom/display-legacy/liboverlay/overlay.cpp
In file included from hardware/qcom/display-legacy/liboverlay/overlay.cpp:30:0:
hardware/qcom/display-legacy/liboverlay/overlayUtils.h:38:36: fatal error: linux/msm_mdp.h: No such file or directory
compilation terminated.
make: *** [/home/spezi77/android/paranoid/out/target/product/bravo/obj/SHARED_LIBRARIES/liboverlay_intermediates/overlay.o] Error 1
make: *** Waiting for unfinished jobs....
Total time elapsed: 17 minutes (1078.277761994 seconds)
[email protected]:~/android/paranoid$
spezi77 said:
Hello there,
I got stuck at building PA for HTC Desire, have tried it several times. I have enough disk space -- I have made a fresh repo sync -- I have also tried with "make -j1". Then switched GCC to armeabi-4.4.3 to 4.7 and to 4.8 -- it always ends up with this error:
Code:
hardware/qcom/display-legacy/liboverlay/overlayUtils.h:38:36: fatal error: linux/msm_mdp.h: No such file or directory
The missing header file is actually present in the kernel tree. I have build with this kernel and the display-legacy a handful of custom roms without any issue.
Kernel: https://github.com/spezi77/android_kernel_htc_qsd8k
Display-legacy: https://github.com/Evervolv/android_hardware_qcom_display-legacy
Any tip is welcome! :good:
Thanks!
More lines:
Code:
target thumb C: libloc_api-rpc <= hardware/qcom/gps-legacy/loc_api/libloc_api-rpc/gen-3200/loc_api_rpc_glue.c
target thumb C: libloc_api-rpc <= hardware/qcom/gps-legacy/loc_api/libloc_api-rpc/src/loc_apicb_appinit.c
target thumb C: libloc_api-rpc <= hardware/qcom/gps-legacy/loc_api/libloc_api-rpc/src/loc_api_sync_call.c
Import includes file: /home/spezi77/android/paranoid/out/target/product/bravo/obj/SHARED_LIBRARIES/gralloc.qsd8k_intermediates/import_includes
target arm C++: libGLESv1_CM <= frameworks/native/opengl/libs/GLES_CM/gl.cpp
Import includes file: /home/spezi77/android/paranoid/out/target/product/bravo/obj/SHARED_LIBRARIES/hwcomposer.qsd8k_intermediates/import_includes
target thumb C++: liboverlay <= hardware/qcom/display-legacy/liboverlay/overlay.cpp
In file included from hardware/qcom/display-legacy/liboverlay/overlay.cpp:30:0:
hardware/qcom/display-legacy/liboverlay/overlayUtils.h:38:36: fatal error: linux/msm_mdp.h: No such file or directory
compilation terminated.
make: *** [/home/spezi77/android/paranoid/out/target/product/bravo/obj/SHARED_LIBRARIES/liboverlay_intermediates/overlay.o] Error 1
make: *** Waiting for unfinished jobs....
Total time elapsed: 17 minutes (1078.277761994 seconds)
[email protected]:~/android/paranoid$
Click to expand...
Click to collapse
Afternoon Matey.
You may get a better response here
http://forum.xda-developers.com/showthread.php?t=1863547
ⓐⓝⓓⓡⓞⓒⓛⓓⓔ ⓘⓢ ⓝⓞⓣ ⓐ ⓢⓘⓝ
Hi I'm getting
Code:
make: *** No rule to make target `vendor/asus/grouper/proprietary/btmacreader', needed by `/home/boncey/android/bonceyrom/out/target/product/grouper/obj/EXECUTABLES/btmacreader_intermediates/btmacreader'. Stop.
make: *** Waiting for unfinished jobs....
external/e2fsprogs/lib/e2p/ls.c: In function 'list_super2':
external/e2fsprogs/lib/e2p/ls.c:354:4: warning: pointer targets in passing argument 2 of 'strncpy' differ in signedness [-Wpointer-sign]
In file included from bionic/libc/include/stdlib.h:34:0,
from external/e2fsprogs/lib/e2p/ls.c:17:
bionic/libc/include/string.h:124:7: note: expected 'const char * __restrict__' but argument is of type '__u8 *'
external/e2fsprogs/lib/e2p/ls.c:368:4: warning: pointer targets in passing argument 2 of 'strncpy' differ in signedness [-Wpointer-sign]
In file included from bionic/libc/include/stdlib.h:34:0,
from external/e2fsprogs/lib/e2p/ls.c:17:
bionic/libc/include/string.h:124:7: note: expected 'const char * __restrict__' but argument is of type '__u8 *'
target thumb C++: bootanimation <= frameworks/base/cmds/bootanimation/BootAnimation.cpp
frameworks/base/cmds/bootanimation/BootAnimation.cpp: In member function 'bool android::BootAnimation::movie()':
frameworks/base/cmds/bootanimation/BootAnimation.cpp:541:22: warning: comparison between signed and unsigned integer expressions [-Wsign-compare]
frameworks/base/cmds/bootanimation/BootAnimation.cpp:560:30: warning: comparison between signed and unsigned integer expressions [-Wsign-compare]
Any ideas guys? I extracted the blobs from my Nexus 7 2012 and I get this error. Any help would be appreciated!
I think I fixed it, will tell you when I get in.
Boncey said:
I think I fixed it, will tell you when I get in.
Click to expand...
Click to collapse
how did you fix it? did you do this?
http://www.reddit.com/r/cyanogenmod/comments/1qsvul/error_building_cyanogenmod_102_for_grouper/
hi guys anyone have idea ???
Code:
/home/shinoa/RS/OMNI/out/host/linux-x86/bin/checkpolicy: loading policy configuration from /home/shinoa/RS/OMNI/out/target/product/geehrc/obj/ETC/sepolicy_intermediates/policy.conf.dontaudit
/home/shinoa/RS/OMNI/out/host/linux-x86/bin/checkpolicy: policy configuration loaded
/home/shinoa/RS/OMNI/out/host/linux-x86/bin/checkpolicy: writing binary representation (version 30) to /home/shinoa/RS/OMNI/out/target/product/geehrc/obj/ETC/sepolicy_intermediates//sepolicy.dontaudit
host Java: signapk (/home/shinoa/RS/OMNI/out/host/common/obj/JAVA_LIBRARIES/signapk_intermediates/classes)
Export includes file: frameworks/native/opengl/libs/GLES_trace/Android.mk -- /home/shinoa/RS/OMNI/out/target/product/geehrc/obj/SHARED_LIBRARIES/libGLES_trace_intermediates/export_includes
target Strip: libexpat (/home/shinoa/RS/OMNI/out/target/product/geehrc/obj/lib/libexpat.so)
target thumb C++: libGLES_trace <= frameworks/native/opengl/libs/GLES_trace/src/gltrace_api.cpp
target thumb C++: libGLES_trace <= frameworks/native/opengl/libs/GLES_trace/src/gltrace_context.cpp
target thumb C++: libGLES_trace <= frameworks/native/opengl/libs/GLES_trace/src/gltrace_egl.cpp
target thumb C++: libGLES_trace <= frameworks/native/opengl/libs/GLES_trace/src/gltrace_eglapi.cpp
target thumb C++: libGLES_trace <= frameworks/native/opengl/libs/GLES_trace/src/gltrace_fixup.cpp
target thumb C++: libGLES_trace <= frameworks/native/opengl/libs/GLES_trace/src/gltrace_hooks.cpp
target thumb C++: libGLES_trace <= frameworks/native/opengl/libs/GLES_trace/src/gltrace_transport.cpp
target thumb C++: libGLES_trace <= /home/shinoa/RS/OMNI/out/target/product/geehrc/gen/SHARED_LIBRARIES/libGLES_trace_intermediates/proto/frameworks/native/opengl/libs/GLES_trace/proto/gltrace.pb.cc
Copy: /home/shinoa/RS/OMNI/out/target/product/geehrc/obj/STATIC_LIBRARIES/libLLVMARMCodeGen_intermediates/ARMGenRegisterInfo.inc
target SharedLib: libssl (/home/shinoa/RS/OMNI/out/target/product/geehrc/obj/SHARED_LIBRARIES/libssl_intermediates/LINKED/libssl.so)
build/core/host_shared_library_internal.mk:51: recipe for target '/home/shinoa/RS/OMNI/out/host/linux-x86/obj/lib/libart.so' failed
#### make failed to build some targets (03:21:03 (hh:mm:ss)) ####
[email protected]:~$
Full log >> http://www.hastebin.com/ovasuzowaw.vhdl